Emerge samba error

Ask questions regarding Gentoox, Gentoo and Linux in general in these forums and we'll do our best to help you!
Post Reply
pallih
Newbie
Posts: 1
Joined: Wed Apr 05, 2006 11:44 am

Emerge samba error

Post by pallih » Wed Apr 05, 2006 11:50 am

I´m trying to run emerge samba - everything works fine until it gets to ghostscript:
i686-pc-linux-gnu-gcc -DHAVE_MKSTEMP -DHAVE_HYPOT -O2 -Wall -Wstrict-prototypes -Wmissing-declarations -Wmissing-prototypes -Wcast-qual -Wwrite-strings -fno-builtin -fno-common -DHAVE_STDINT_H -DGX_COLOR_INDEX_TYPE="unsigned long long" -march=pentium3 -O2 -fomit-frame-pointer -pipe -I./obj -I./src -o ./obj/gdevcups.o -c pstoraster/gdevcups.c
pstoraster/gdevcups.c:64:25: cups/raster.h: No such file or directory
pstoraster/gdevcups.c:65:22: cups/ppd.h: No such file or directory
pstoraster/gdevcups.c:191: error: syntax error before "cups_raster_t"
pstoraster/gdevcups.c:191: warning: no semicolon at end of struct or union
pstoraster/gdevcups.c:192: warning: type defaults to `int' in declaration of `header'
pstoraster/gdevcups.c:192: warning: data definition has no type or storage class
pstoraster/gdevcups.c:194: error: syntax error before '}' token
pstoraster/gdevcups.c:194: warning: type defaults to `int' in declaration of `gx_device_cups'
pstoraster/gdevcups.c:194: warning: data definition has no type or storage class
pstoraster/gdevcups.c:277: error: syntax error before "gs_cups_device"
pstoraster/gdevcups.c:277: warning: type defaults to `int' in declaration of `gs_cups_device'
pstoraster/gdevcups.c:279: warning: excess elements in scalar initializer
pstoraster/gdevcups.c:279: warning: (near initialization for `gs_cups_device')
pstoraster/gdevcups.c:279: warning: excess elements in scalar initializer
pstoraster/gdevcups.c:279: warning: (near initialization for `gs_cups_device')
pstoraster/gdevcups.c:279: warning: excess elements in scalar initializer
pstoraster/gdevcups.c:279: warning: (near initialization for `gs_cups_device')
pstoraster/gdevcups.c:279: warning: excess elements in scalar initializer
pstoraster/gdevcups.c:279: warning: (near initialization for `gs_cups_device')
pstoraster/gdevcups.c:279: warning: excess elements in scalar initializer
pstoraster/gdevcups.c:279: warning: (near initialization for `gs_cups_device')
pstoraster/gdevcups.c:279: warning: excess elements in scalar initializer
pstoraster/gdevcups.c:279: warning: (near initialization for `gs_cups_device')
pstoraster/gdevcups.c:279: warning: braces around scalar initializer
pstoraster/gdevcups.c:279: warning: (near initialization for `gs_cups_device')
pstoraster/gdevcups.c:279: warning: excess elements in scalar initializer
pstoraster/gdevcups.c:279: warning: (near initialization for `gs_cups_device')
pstoraster/gdevcups.c:279: warning: excess elements in scalar initializer
pstoraster/gdevcups.c:279: warning: (near initialization for `gs_cups_device')
pstoraster/gdevcups.c:279: warning: excess elements in scalar initializer
pstoraster/gdevcups.c:279: warning: (near initialization for `gs_cups_device')
pstoraster/gdevcups.c:279: warning: excess elements in scalar initializer
pstoraster/gdevcups.c:279: warning: (near initialization for `gs_cups_device')
pstoraster/gdevcups.c:279: warning: braces around scalar initializer
pstoraster/gdevcups.c:279: warning: (near initialization for `gs_cups_device')
pstoraster/gdevcups.c:279: warning: excess elements in scalar initializer
pstoraster/gdevcups.c:279: warning: (near initialization for `gs_cups_device')
pstoraster/gdevcups.c:279: warning: excess elements in scalar initializer
pstoraster/gdevcups.c:279: warning: (near initialization for `gs_cups_device')
pstoraster/gdevcups.c:279: warning: excess elements in scalar initializer
pstoraster/gdevcups.c:279: warning: (near initialization for `gs_cups_device')
pstoraster/gdevcups.c:279: warning: excess elements in scalar initializer
pstoraster/gdevcups.c:279: warning: (near initialization for `gs_cups_device')
pstoraster/gdevcups.c:279: warning: excess elements in scalar initializer
pstoraster/gdevcups.c:279: warning: (near initialization for `gs_cups_device')
pstoraster/gdevcups.c:279: warning: excess elements in scalar initializer
pstoraster/gdevcups.c:279: warning: (near initialization for `gs_cups_device')
pstoraster/gdevcups.c:279: warning: excess elements in scalar initializer
pstoraster/gdevcups.c:279: warning: (near initialization for `gs_cups_device')
pstoraster/gdevcups.c:279: warning: excess elements in scalar initializer
pstoraster/gdevcups.c:279: warning: (near initialization for `gs_cups_device')
pstoraster/gdevcups.c:279: warning: braces around scalar initializer
pstoraster/gdevcups.c:279: warning: (near initialization for `gs_cups_device')
pstoraster/gdevcups.c:279: warning: excess elements in scalar initializer
pstoraster/gdevcups.c:279: warning: (near initialization for `gs_cups_device')
pstoraster/gdevcups.c:279: warning: excess elements in scalar initializer
pstoraster/gdevcups.c:279: warning: (near initialization for `gs_cups_device')
pstoraster/gdevcups.c:279: warning: excess elements in scalar initializer
pstoraster/gdevcups.c:279: warning: (near initialization for `gs_cups_device')
pstoraster/gdevcups.c:279: warning: braces around scalar initializer
pstoraster/gdevcups.c:279: warning: (near initialization for `gs_cups_device')
pstoraster/gdevcups.c:279: warning: excess elements in scalar initializer
pstoraster/gdevcups.c:279: warning: (near initialization for `gs_cups_device')
pstoraster/gdevcups.c:279: warning: braces around scalar initializer
pstoraster/gdevcups.c:279: warning: (near initialization for `gs_cups_device')
pstoraster/gdevcups.c:279: warning: excess elements in scalar initializer
pstoraster/gdevcups.c:279: warning: (near initialization for `gs_cups_device')
pstoraster/gdevcups.c:279: warning: braces around scalar initializer
pstoraster/gdevcups.c:279: warning: (near initialization for `gs_cups_device')
pstoraster/gdevcups.c:279: warning: excess elements in scalar initializer
pstoraster/gdevcups.c:279: warning: (near initialization for `gs_cups_device')
pstoraster/gdevcups.c:279: warning: excess elements in scalar initializer
pstoraster/gdevcups.c:279: warning: (near initialization for `gs_cups_device')
pstoraster/gdevcups.c:279: warning: excess elements in scalar initializer
pstoraster/gdevcups.c:279: warning: (near initialization for `gs_cups_device')
pstoraster/gdevcups.c:279: warning: excess elements in scalar initializer
pstoraster/gdevcups.c:279: warning: (near initialization for `gs_cups_device')
pstoraster/gdevcups.c:279: warning: excess elements in scalar initializer
pstoraster/gdevcups.c:279: warning: (near initialization for `gs_cups_device')
pstoraster/gdevcups.c:279: warning: braces around scalar initializer
pstoraster/gdevcups.c:279: warning: (near initialization for `gs_cups_device')
pstoraster/gdevcups.c:279: warning: overflow in implicit constant conversion
pstoraster/gdevcups.c:279: warning: excess elements in scalar initializer
pstoraster/gdevcups.c:279: warning: (near initialization for `gs_cups_device')
pstoraster/gdevcups.c:279: warning: excess elements in scalar initializer
pstoraster/gdevcups.c:279: warning: (near initialization for `gs_cups_device')
pstoraster/gdevcups.c:279: warning: excess elements in scalar initializer
pstoraster/gdevcups.c:279: warning: (near initialization for `gs_cups_device')
pstoraster/gdevcups.c:279: warning: excess elements in scalar initializer
pstoraster/gdevcups.c:279: warning: (near initialization for `gs_cups_device')
pstoraster/gdevcups.c:279: warning: braces around scalar initializer
pstoraster/gdevcups.c:279: warning: (near initialization for `gs_cups_device')
pstoraster/gdevcups.c:279: warning: excess elements in scalar initializer
pstoraster/gdevcups.c:279: warning: (near initialization for `gs_cups_device')
pstoraster/gdevcups.c:279: warning: excess elements in scalar initializer
pstoraster/gdevcups.c:279: warning: (near initialization for `gs_cups_device')
pstoraster/gdevcups.c:279: warning: braces around scalar initializer
pstoraster/gdevcups.c:279: warning: (near initialization for `gs_cups_device')
pstoraster/gdevcups.c:279: warning: excess elements in scalar initializer
pstoraster/gdevcups.c:279: warning: (near initialization for `gs_cups_device')
pstoraster/gdevcups.c:279: warning: excess elements in scalar initializer
pstoraster/gdevcups.c:279: warning: (near initialization for `gs_cups_device')
pstoraster/gdevcups.c:279: warning: excess elements in scalar initializer
pstoraster/gdevcups.c:279: warning: (near initialization for `gs_cups_device')
pstoraster/gdevcups.c:279: warning: excess elements in scalar initializer
pstoraster/gdevcups.c:279: warning: (near initialization for `gs_cups_device')
pstoraster/gdevcups.c:279: warning: excess elements in scalar initializer
pstoraster/gdevcups.c:279: warning: (near initialization for `gs_cups_device')
pstoraster/gdevcups.c:279: warning: braces around scalar initializer
pstoraster/gdevcups.c:279: warning: (near initialization for `gs_cups_device')
pstoraster/gdevcups.c:279: warning: excess elements in scalar initializer
pstoraster/gdevcups.c:279: warning: (near initialization for `gs_cups_device')
pstoraster/gdevcups.c:279: warning: excess elements in scalar initializer
pstoraster/gdevcups.c:279: warning: (near initialization for `gs_cups_device')
pstoraster/gdevcups.c:279: warning: braces around scalar initializer
pstoraster/gdevcups.c:279: warning: (near initialization for `gs_cups_device')
pstoraster/gdevcups.c:279: warning: excess elements in scalar initializer
pstoraster/gdevcups.c:279: warning: (near initialization for `gs_cups_device')
pstoraster/gdevcups.c:279: warning: excess elements in scalar initializer
pstoraster/gdevcups.c:279: warning: (near initialization for `gs_cups_device')
pstoraster/gdevcups.c:279: warning: braces around scalar initializer
pstoraster/gdevcups.c:279: warning: (near initialization for `gs_cups_device')
pstoraster/gdevcups.c:279: warning: excess elements in scalar initializer
pstoraster/gdevcups.c:279: warning: (near initialization for `gs_cups_device')
pstoraster/gdevcups.c:279: warning: excess elements in scalar initializer
pstoraster/gdevcups.c:279: warning: (near initialization for `gs_cups_device')
pstoraster/gdevcups.c:279: warning: braces around scalar initializer
pstoraster/gdevcups.c:279: warning: (near initialization for `gs_cups_device')
pstoraster/gdevcups.c:279: warning: excess elements in scalar initializer
pstoraster/gdevcups.c:279: warning: (near initialization for `gs_cups_device')
pstoraster/gdevcups.c:279: warning: excess elements in scalar initializer
pstoraster/gdevcups.c:279: warning: (near initialization for `gs_cups_device')
pstoraster/gdevcups.c:279: warning: excess elements in scalar initializer
pstoraster/gdevcups.c:279: warning: (near initialization for `gs_cups_device')
pstoraster/gdevcups.c:279: warning: excess elements in scalar initializer
pstoraster/gdevcups.c:279: warning: (near initialization for `gs_cups_device')
pstoraster/gdevcups.c:279: warning: excess elements in scalar initializer
pstoraster/gdevcups.c:279: warning: (near initialization for `gs_cups_device')
pstoraster/gdevcups.c:279: warning: excess elements in scalar initializer
pstoraster/gdevcups.c:279: warning: (near initialization for `gs_cups_device')
pstoraster/gdevcups.c:279: warning: excess elements in scalar initializer
pstoraster/gdevcups.c:279: warning: (near initialization for `gs_cups_device')
pstoraster/gdevcups.c:279: warning: excess elements in scalar initializer
pstoraster/gdevcups.c:279: warning: (near initialization for `gs_cups_device')
pstoraster/gdevcups.c:279: warning: excess elements in scalar initializer
pstoraster/gdevcups.c:279: warning: (near initialization for `gs_cups_device')
pstoraster/gdevcups.c:279: warning: excess elements in scalar initializer
pstoraster/gdevcups.c:279: warning: (near initialization for `gs_cups_device')
pstoraster/gdevcups.c:279: warning: excess elements in scalar initializer
pstoraster/gdevcups.c:279: warning: (near initialization for `gs_cups_device')
pstoraster/gdevcups.c:279: warning: braces around scalar initializer
pstoraster/gdevcups.c:279: warning: (near initialization for `gs_cups_device')
pstoraster/gdevcups.c:279: warning: initialization makes integer from pointer without a cast
pstoraster/gdevcups.c:279: warning: excess elements in scalar initializer
pstoraster/gdevcups.c:279: warning: (near initialization for `gs_cups_device')
pstoraster/gdevcups.c:279: warning: excess elements in scalar initializer
pstoraster/gdevcups.c:279: warning: (near initialization for `gs_cups_device')
pstoraster/gdevcups.c:279: warning: excess elements in scalar initializer
pstoraster/gdevcups.c:279: warning: (near initialization for `gs_cups_device')
pstoraster/gdevcups.c:279: warning: braces around scalar initializer
pstoraster/gdevcups.c:279: warning: (near initialization for `gs_cups_device')
pstoraster/gdevcups.c:279: warning: excess elements in scalar initializer
pstoraster/gdevcups.c:279: warning: (near initialization for `gs_cups_device')
pstoraster/gdevcups.c:279: warning: braces around scalar initializer
pstoraster/gdevcups.c:279: warning: (near initialization for `gs_cups_device')
pstoraster/gdevcups.c:279: warning: excess elements in scalar initializer
pstoraster/gdevcups.c:279: warning: (near initialization for `gs_cups_device')
pstoraster/gdevcups.c:279: warning: braces around scalar initializer
pstoraster/gdevcups.c:279: warning: (near initialization for `gs_cups_device')
pstoraster/gdevcups.c:279: warning: initialization makes integer from pointer without a cast
pstoraster/gdevcups.c:279: warning: excess elements in scalar initializer
pstoraster/gdevcups.c:279: warning: (near initialization for `gs_cups_device')
pstoraster/gdevcups.c:279: warning: braces around scalar initializer
pstoraster/gdevcups.c:279: warning: (near initialization for `gs_cups_device')
pstoraster/gdevcups.c:279: warning: initialization makes integer from pointer without a cast
pstoraster/gdevcups.c:279: warning: excess elements in scalar initializer
pstoraster/gdevcups.c:279: warning: (near initialization for `gs_cups_device')
pstoraster/gdevcups.c:279: warning: excess elements in scalar initializer
pstoraster/gdevcups.c:279: warning: (near initialization for `gs_cups_device')
pstoraster/gdevcups.c:279: warning: excess elements in scalar initializer
pstoraster/gdevcups.c:279: warning: (near initialization for `gs_cups_device')
pstoraster/gdevcups.c:279: warning: excess elements in scalar initializer
pstoraster/gdevcups.c:279: warning: (near initialization for `gs_cups_device')
pstoraster/gdevcups.c:279: warning: excess elements in scalar initializer
pstoraster/gdevcups.c:279: warning: (near initialization for `gs_cups_device')
pstoraster/gdevcups.c:279: warning: excess elements in scalar initializer
pstoraster/gdevcups.c:279: warning: (near initialization for `gs_cups_device')
pstoraster/gdevcups.c:279: warning: excess elements in scalar initializer
pstoraster/gdevcups.c:279: warning: (near initialization for `gs_cups_device')
pstoraster/gdevcups.c:279: warning: excess elements in scalar initializer
pstoraster/gdevcups.c:279: warning: (near initialization for `gs_cups_device')
pstoraster/gdevcups.c:279: warning: excess elements in scalar initializer
pstoraster/gdevcups.c:279: warning: (near initialization for `gs_cups_device')
pstoraster/gdevcups.c:279: warning: excess elements in scalar initializer
pstoraster/gdevcups.c:279: warning: (near initialization for `gs_cups_device')
pstoraster/gdevcups.c:279: warning: braces around scalar initializer
pstoraster/gdevcups.c:279: warning: (near initialization for `gs_cups_device')
pstoraster/gdevcups.c:279: warning: excess elements in scalar initializer
pstoraster/gdevcups.c:279: warning: (near initialization for `gs_cups_device')
pstoraster/gdevcups.c:279: warning: braces around scalar initializer
pstoraster/gdevcups.c:279: warning: (near initialization for `gs_cups_device')
pstoraster/gdevcups.c:279: warning: excess elements in scalar initializer
pstoraster/gdevcups.c:279: warning: (near initialization for `gs_cups_device')
pstoraster/gdevcups.c:279: warning: excess elements in scalar initializer
pstoraster/gdevcups.c:279: warning: (near initialization for `gs_cups_device')
pstoraster/gdevcups.c:279: warning: excess elements in scalar initializer
pstoraster/gdevcups.c:279: warning: (near initialization for `gs_cups_device')
pstoraster/gdevcups.c:279: warning: excess elements in scalar initializer
pstoraster/gdevcups.c:279: warning: (near initialization for `gs_cups_device')
pstoraster/gdevcups.c:279: warning: excess elements in scalar initializer
pstoraster/gdevcups.c:279: warning: (near initialization for `gs_cups_device')
pstoraster/gdevcups.c:279: warning: excess elements in scalar initializer
pstoraster/gdevcups.c:279: warning: (near initialization for `gs_cups_device')
pstoraster/gdevcups.c:279: warning: braces around scalar initializer
pstoraster/gdevcups.c:279: warning: (near initialization for `gs_cups_device')
pstoraster/gdevcups.c:279: warning: excess elements in scalar initializer
pstoraster/gdevcups.c:279: warning: (near initialization for `gs_cups_device')
pstoraster/gdevcups.c:279: warning: excess elements in scalar initializer
pstoraster/gdevcups.c:279: warning: (near initialization for `gs_cups_device')
pstoraster/gdevcups.c:279: warning: excess elements in scalar initializer
pstoraster/gdevcups.c:279: warning: (near initialization for `gs_cups_device')
pstoraster/gdevcups.c:279: warning: excess elements in scalar initializer
pstoraster/gdevcups.c:279: warning: (near initialization for `gs_cups_device')
pstoraster/gdevcups.c:279: warning: excess elements in scalar initializer
pstoraster/gdevcups.c:279: warning: (near initialization for `gs_cups_device')
pstoraster/gdevcups.c:279: warning: excess elements in scalar initializer
pstoraster/gdevcups.c:279: warning: (near initialization for `gs_cups_device')
pstoraster/gdevcups.c:279: warning: excess elements in scalar initializer
pstoraster/gdevcups.c:279: warning: (near initialization for `gs_cups_device')
pstoraster/gdevcups.c:279: warning: excess elements in scalar initializer
pstoraster/gdevcups.c:279: warning: (near initialization for `gs_cups_device')
pstoraster/gdevcups.c:279: warning: excess elements in scalar initializer
pstoraster/gdevcups.c:279: warning: (near initialization for `gs_cups_device')
pstoraster/gdevcups.c:279: warning: excess elements in scalar initializer
pstoraster/gdevcups.c:279: warning: (near initialization for `gs_cups_device')
pstoraster/gdevcups.c:279: warning: excess elements in scalar initializer
pstoraster/gdevcups.c:279: warning: (near initialization for `gs_cups_device')
pstoraster/gdevcups.c:279: warning: excess elements in scalar initializer
pstoraster/gdevcups.c:279: warning: (near initialization for `gs_cups_device')
pstoraster/gdevcups.c:279: warning: excess elements in scalar initializer
pstoraster/gdevcups.c:279: warning: (near initialization for `gs_cups_device')
pstoraster/gdevcups.c:279: warning: excess elements in scalar initializer
pstoraster/gdevcups.c:279: warning: (near initialization for `gs_cups_device')
pstoraster/gdevcups.c:279: warning: excess elements in scalar initializer
pstoraster/gdevcups.c:279: warning: (near initialization for `gs_cups_device')
pstoraster/gdevcups.c:279: warning: excess elements in scalar initializer
pstoraster/gdevcups.c:279: warning: (near initialization for `gs_cups_device')
pstoraster/gdevcups.c:279: warning: braces around scalar initializer
pstoraster/gdevcups.c:279: warning: (near initialization for `gs_cups_device')
pstoraster/gdevcups.c:279: warning: excess elements in scalar initializer
pstoraster/gdevcups.c:279: warning: (near initialization for `gs_cups_device')
pstoraster/gdevcups.c:300: warning: excess elements in scalar initializer
pstoraster/gdevcups.c:300: warning: (near initialization for `gs_cups_device')
pstoraster/gdevcups.c:301: warning: excess elements in scalar initializer
pstoraster/gdevcups.c:301: warning: (near initialization for `gs_cups_device')
pstoraster/gdevcups.c:302: warning: braces around scalar initializer
pstoraster/gdevcups.c:302: warning: (near initialization for `gs_cups_device')
pstoraster/gdevcups.c:303: warning: initialization makes integer from pointer without a cast
pstoraster/gdevcups.c:304: warning: excess elements in scalar initializer
pstoraster/gdevcups.c:304: warning: (near initialization for `gs_cups_device')
pstoraster/gdevcups.c:305: warning: excess elements in scalar initializer
pstoraster/gdevcups.c:305: warning: (near initialization for `gs_cups_device')
pstoraster/gdevcups.c:306: warning: excess elements in scalar initializer
pstoraster/gdevcups.c:306: warning: (near initialization for `gs_cups_device')
pstoraster/gdevcups.c:307: warning: excess elements in scalar initializer
pstoraster/gdevcups.c:307: warning: (near initialization for `gs_cups_device')
pstoraster/gdevcups.c:308: error: `CUPS_ADVANCE_NONE' undeclared here (not in a function)
pstoraster/gdevcups.c:308: warning: excess elements in scalar initializer
pstoraster/gdevcups.c:308: warning: (near initialization for `gs_cups_device')
pstoraster/gdevcups.c:309: error: `CUPS_FALSE' undeclared here (not in a function)
pstoraster/gdevcups.c:309: warning: excess elements in scalar initializer
pstoraster/gdevcups.c:309: warning: (near initialization for `gs_cups_device')
pstoraster/gdevcups.c:310: error: `CUPS_CUT_NONE' undeclared here (not in a function)
pstoraster/gdevcups.c:310: warning: excess elements in scalar initializer
pstoraster/gdevcups.c:310: warning: (near initialization for `gs_cups_device')
pstoraster/gdevcups.c:311: error: `CUPS_FALSE' undeclared here (not in a function)
pstoraster/gdevcups.c:311: warning: excess elements in scalar initializer
pstoraster/gdevcups.c:311: warning: (near initialization for `gs_cups_device')
pstoraster/gdevcups.c:312: warning: braces around scalar initializer
pstoraster/gdevcups.c:312: warning: (near initialization for `gs_cups_device')
pstoraster/gdevcups.c:312: warning: excess elements in scalar initializer
pstoraster/gdevcups.c:312: warning: (near initialization for `gs_cups_device')
pstoraster/gdevcups.c:312: warning: excess elements in scalar initializer
pstoraster/gdevcups.c:312: warning: (near initialization for `gs_cups_device')
pstoraster/gdevcups.c:313: warning: braces around scalar initializer
pstoraster/gdevcups.c:313: warning: (near initialization for `gs_cups_device')
pstoraster/gdevcups.c:313: warning: excess elements in scalar initializer
pstoraster/gdevcups.c:313: warning: (near initialization for `gs_cups_device')
pstoraster/gdevcups.c:313: warning: excess elements in scalar initializer
pstoraster/gdevcups.c:313: warning: (near initialization for `gs_cups_device')
pstoraster/gdevcups.c:313: warning: excess elements in scalar initializer
pstoraster/gdevcups.c:313: warning: (near initialization for `gs_cups_device')
pstoraster/gdevcups.c:313: warning: excess elements in scalar initializer
pstoraster/gdevcups.c:313: warning: (near initialization for `gs_cups_device')
pstoraster/gdevcups.c:314: error: `CUPS_FALSE' undeclared here (not in a function)
pstoraster/gdevcups.c:314: warning: excess elements in scalar initializer
pstoraster/gdevcups.c:314: warning: (near initialization for `gs_cups_device')
pstoraster/gdevcups.c:315: error: `CUPS_JOG_NONE' undeclared here (not in a function)
pstoraster/gdevcups.c:315: warning: excess elements in scalar initializer
pstoraster/gdevcups.c:315: warning: (near initialization for `gs_cups_device')
pstoraster/gdevcups.c:316: error: `CUPS_EDGE_TOP' undeclared here (not in a function)
pstoraster/gdevcups.c:316: warning: excess elements in scalar initializer
pstoraster/gdevcups.c:316: warning: (near initialization for `gs_cups_device')
pstoraster/gdevcups.c:317: warning: braces around scalar initializer
pstoraster/gdevcups.c:317: warning: (near initialization for `gs_cups_device')
pstoraster/gdevcups.c:317: warning: excess elements in scalar initializer
pstoraster/gdevcups.c:317: warning: (near initialization for `gs_cups_device')
pstoraster/gdevcups.c:317: warning: excess elements in scalar initializer
pstoraster/gdevcups.c:317: warning: (near initialization for `gs_cups_device')
pstoraster/gdevcups.c:318: error: `CUPS_FALSE' undeclared here (not in a function)
pstoraster/gdevcups.c:318: warning: excess elements in scalar initializer
pstoraster/gdevcups.c:318: warning: (near initialization for `gs_cups_device')
pstoraster/gdevcups.c:319: warning: excess elements in scalar initializer
pstoraster/gdevcups.c:319: warning: (near initialization for `gs_cups_device')
pstoraster/gdevcups.c:320: warning: excess elements in scalar initializer
pstoraster/gdevcups.c:320: warning: (near initialization for `gs_cups_device')
pstoraster/gdevcups.c:321: error: `CUPS_FALSE' undeclared here (not in a function)
pstoraster/gdevcups.c:321: warning: excess elements in scalar initializer
pstoraster/gdevcups.c:321: warning: (near initialization for `gs_cups_device')
pstoraster/gdevcups.c:322: error: `CUPS_FALSE' undeclared here (not in a function)
pstoraster/gdevcups.c:322: warning: excess elements in scalar initializer
pstoraster/gdevcups.c:322: warning: (near initialization for `gs_cups_device')
pstoraster/gdevcups.c:323: warning: excess elements in scalar initializer
pstoraster/gdevcups.c:323: warning: (near initialization for `gs_cups_device')
pstoraster/gdevcups.c:324: error: `CUPS_ORIENT_0' undeclared here (not in a function)
pstoraster/gdevcups.c:324: warning: excess elements in scalar initializer
pstoraster/gdevcups.c:324: warning: (near initialization for `gs_cups_device')
pstoraster/gdevcups.c:325: error: `CUPS_FALSE' undeclared here (not in a function)
pstoraster/gdevcups.c:325: warning: excess elements in scalar initializer
pstoraster/gdevcups.c:325: warning: (near initialization for `gs_cups_device')
pstoraster/gdevcups.c:326: warning: braces around scalar initializer
pstoraster/gdevcups.c:326: warning: (near initialization for `gs_cups_device')
pstoraster/gdevcups.c:326: warning: excess elements in scalar initializer
pstoraster/gdevcups.c:326: warning: (near initialization for `gs_cups_device')
pstoraster/gdevcups.c:326: warning: excess elements in scalar initializer
pstoraster/gdevcups.c:326: warning: (near initialization for `gs_cups_device')
pstoraster/gdevcups.c:327: error: `CUPS_FALSE' undeclared here (not in a function)
pstoraster/gdevcups.c:327: warning: excess elements in scalar initializer
pstoraster/gdevcups.c:327: warning: (near initialization for `gs_cups_device')
pstoraster/gdevcups.c:328: error: `CUPS_FALSE' undeclared here (not in a function)
pstoraster/gdevcups.c:328: warning: excess elements in scalar initializer
pstoraster/gdevcups.c:328: warning: (near initialization for `gs_cups_device')
pstoraster/gdevcups.c:329: error: `CUPS_FALSE' undeclared here (not in a function)
pstoraster/gdevcups.c:329: warning: excess elements in scalar initializer
pstoraster/gdevcups.c:329: warning: (near initialization for `gs_cups_device')
pstoraster/gdevcups.c:330: warning: excess elements in scalar initializer
pstoraster/gdevcups.c:330: warning: (near initialization for `gs_cups_device')
pstoraster/gdevcups.c:331: warning: excess elements in scalar initializer
pstoraster/gdevcups.c:331: warning: (near initialization for `gs_cups_device')
pstoraster/gdevcups.c:332: warning: excess elements in scalar initializer
pstoraster/gdevcups.c:332: warning: (near initialization for `gs_cups_device')
pstoraster/gdevcups.c:333: warning: excess elements in scalar initializer
pstoraster/gdevcups.c:333: warning: (near initialization for `gs_cups_device')
pstoraster/gdevcups.c:334: warning: excess elements in scalar initializer
pstoraster/gdevcups.c:334: warning: (near initialization for `gs_cups_device')
pstoraster/gdevcups.c:335: warning: excess elements in scalar initializer
pstoraster/gdevcups.c:335: warning: (near initialization for `gs_cups_device')
pstoraster/gdevcups.c:336: error: `CUPS_ORDER_CHUNKED' undeclared here (not in a function)
pstoraster/gdevcups.c:336: warning: excess elements in scalar initializer
pstoraster/gdevcups.c:336: warning: (near initialization for `gs_cups_device')
pstoraster/gdevcups.c:337: error: `CUPS_CSPACE_K' undeclared here (not in a function)
pstoraster/gdevcups.c:337: warning: excess elements in scalar initializer
pstoraster/gdevcups.c:337: warning: (near initialization for `gs_cups_device')
pstoraster/gdevcups.c:338: warning: excess elements in scalar initializer
pstoraster/gdevcups.c:338: warning: (near initialization for `gs_cups_device')
pstoraster/gdevcups.c:339: warning: excess elements in scalar initializer
pstoraster/gdevcups.c:339: warning: (near initialization for `gs_cups_device')
pstoraster/gdevcups.c:340: warning: excess elements in scalar initializer
pstoraster/gdevcups.c:340: warning: (near initialization for `gs_cups_device')
pstoraster/gdevcups.c:342: warning: excess elements in scalar initializer
pstoraster/gdevcups.c:342: warning: (near initialization for `gs_cups_device')
pstoraster/gdevcups.c:342: warning: excess elements in scalar initializer
pstoraster/gdevcups.c:342: warning: (near initialization for `gs_cups_device')
pstoraster/gdevcups.c:343: warning: data definition has no type or storage class
pstoraster/gdevcups.c:354: error: syntax error before '*' token
pstoraster/gdevcups.c:354: warning: type defaults to `int' in declaration of `cupsPPD'
pstoraster/gdevcups.c:354: warning: data definition has no type or storage class
pstoraster/gdevcups.c: In function `cups_close':
pstoraster/gdevcups.c:409: error: syntax error before ')' token
pstoraster/gdevcups.c:411: warning: implicit declaration of function `cupsRasterClose'
pstoraster/gdevcups.c:411: error: syntax error before ')' token
pstoraster/gdevcups.c:412: error: syntax error before ')' token
pstoraster/gdevcups.c: In function `cups_decode_color':
pstoraster/gdevcups.c:448: error: syntax error before ')' token
pstoraster/gdevcups.c:448: error: `CUPS_CSPACE_KCMYcm' undeclared (first use in this function)
pstoraster/gdevcups.c:448: error: (Each undeclared identifier is reported only once
pstoraster/gdevcups.c:448: error: for each function it appears in.)
pstoraster/gdevcups.c:449: error: syntax error before ')' token
pstoraster/gdevcups.c:462: error: syntax error before ')' token
pstoraster/gdevcups.c:465: error: syntax error before ')' token
pstoraster/gdevcups.c: In function `cups_encode_color':
pstoraster/gdevcups.c:494: error: syntax error before ')' token
pstoraster/gdevcups.c:497: error: syntax error before ')' token
pstoraster/gdevcups.c:505: error: syntax error before ')' token
pstoraster/gdevcups.c:505: error: `CUPS_CSPACE_KCMYcm' undeclared (first use in this function)
pstoraster/gdevcups.c:506: error: syntax error before ')' token
pstoraster/gdevcups.c: In function `cups_get_matrix':
pstoraster/gdevcups.c:564: error: syntax error before ')' token
pstoraster/gdevcups.c:564: error: syntax error before ')' token
pstoraster/gdevcups.c:565: error: syntax error before ')' token
pstoraster/gdevcups.c:565: error: syntax error before ')' token
pstoraster/gdevcups.c:571: error: syntax error before ')' token
pstoraster/gdevcups.c:572: error: syntax error before ')' token
pstoraster/gdevcups.c:577: error: request for member `flip_duplex' in something not a structure or union
pstoraster/gdevcups.c:580: error: syntax error before ')' token
pstoraster/gdevcups.c:586: error: syntax error before ')' token
pstoraster/gdevcups.c:586: error: syntax error before ')' token
pstoraster/gdevcups.c:587: error: request for member `flip_duplex' in something not a structure or union
pstoraster/gdevcups.c:587: error: syntax error before ')' token
pstoraster/gdevcups.c:590: error: syntax error before ')' token
pstoraster/gdevcups.c:591: error: syntax error before ')' token
pstoraster/gdevcups.c:593: error: syntax error before ')' token
pstoraster/gdevcups.c:594: error: syntax error before ')' token
pstoraster/gdevcups.c:595: error: syntax error before ')' token
pstoraster/gdevcups.c:600: error: syntax error before ')' token
pstoraster/gdevcups.c:601: error: syntax error before ')' token
pstoraster/gdevcups.c:603: error: syntax error before ')' token
pstoraster/gdevcups.c:604: error: syntax error before ')' token
pstoraster/gdevcups.c:607: error: syntax error before ')' token
pstoraster/gdevcups.c:607: error: syntax error before ')' token
pstoraster/gdevcups.c:608: error: request for member `flip_duplex' in something not a structure or union
pstoraster/gdevcups.c:608: error: syntax error before ')' token
pstoraster/gdevcups.c:610: error: syntax error before ')' token
pstoraster/gdevcups.c:613: error: syntax error before ')' token
pstoraster/gdevcups.c:614: error: syntax error before ')' token
pstoraster/gdevcups.c:615: error: syntax error before ')' token
pstoraster/gdevcups.c:619: error: syntax error before ')' token
pstoraster/gdevcups.c:622: error: syntax error before ')' token
pstoraster/gdevcups.c:623: error: syntax error before ')' token
pstoraster/gdevcups.c:624: error: syntax error before ')' token
pstoraster/gdevcups.c:625: error: syntax error before ')' token
pstoraster/gdevcups.c:628: error: syntax error before ')' token
pstoraster/gdevcups.c:629: error: syntax error before ')' token
pstoraster/gdevcups.c:631: error: syntax error before ')' token
pstoraster/gdevcups.c:631: error: syntax error before ')' token
pstoraster/gdevcups.c:632: error: syntax error before ')' token
pstoraster/gdevcups.c:632: error: syntax error before ')' token
pstoraster/gdevcups.c: In function `cups_get_params':
pstoraster/gdevcups.c:677: error: syntax error before ')' token
pstoraster/gdevcups.c:677: warning: left-hand operand of comma expression has no effect
pstoraster/gdevcups.c:684: error: syntax error before ')' token
pstoraster/gdevcups.c:690: error: syntax error before ')' token
pstoraster/gdevcups.c:695: error: syntax error before ')' token
pstoraster/gdevcups.c:702: error: syntax error before ')' token
pstoraster/gdevcups.c:707: error: syntax error before ')' token
pstoraster/gdevcups.c:714: error: syntax error before ')' token
pstoraster/gdevcups.c:720: error: syntax error before ')' token
pstoraster/gdevcups.c:725: error: syntax error before ')' token
pstoraster/gdevcups.c:732: error: syntax error before ')' token
pstoraster/gdevcups.c:737: error: syntax error before ')' token
pstoraster/gdevcups.c:743: error: syntax error before ')' token
pstoraster/gdevcups.c:749: error: syntax error before ')' token
pstoraster/gdevcups.c:755: error: syntax error before ')' token
pstoraster/gdevcups.c:761: error: syntax error before ')' token
pstoraster/gdevcups.c:767: error: syntax error before ')' token
pstoraster/gdevcups.c:774: error: syntax error before ')' token
pstoraster/gdevcups.c:780: error: syntax error before ')' token
pstoraster/gdevcups.c:786: error: syntax error before ')' token
pstoraster/gdevcups.c:792: error: syntax error before ')' token
pstoraster/gdevcups.c:798: error: syntax error before ')' token
pstoraster/gdevcups.c:804: error: syntax error before ')' token
pstoraster/gdevcups.c:810: error: syntax error before ')' token
pstoraster/gdevcups.c:816: error: syntax error before ')' token
pstoraster/gdevcups.c:822: error: syntax error before ')' token
pstoraster/gdevcups.c:828: error: syntax error before ')' token
pstoraster/gdevcups.c:834: error: syntax error before ')' token
pstoraster/gdevcups.c:840: error: syntax error before ')' token
pstoraster/gdevcups.c: In function `cups_map_cmyk':
pstoraster/gdevcups.c:995: error: syntax error before ')' token
pstoraster/gdevcups.c:997: error: `CUPS_CSPACE_W' undeclared (first use in this function)
pstoraster/gdevcups.c:1008: error: `CUPS_CSPACE_RGBA' undeclared (first use in this function)
pstoraster/gdevcups.c:1011: error: `CUPS_CSPACE_RGB' undeclared (first use in this function)
pstoraster/gdevcups.c:1039: error: `CUPS_CSPACE_K' undeclared (first use in this function)
pstoraster/gdevcups.c:1050: error: `CUPS_CSPACE_CMY' undeclared (first use in this function)
pstoraster/gdevcups.c:1077: error: `CUPS_CSPACE_YMC' undeclared (first use in this function)
pstoraster/gdevcups.c:1104: error: `CUPS_CSPACE_CMYK' undeclared (first use in this function)
pstoraster/gdevcups.c:1134: error: `CUPS_CSPACE_YMCK' undeclared (first use in this function)
pstoraster/gdevcups.c:1135: error: `CUPS_CSPACE_GMCK' undeclared (first use in this function)
pstoraster/gdevcups.c:1136: error: `CUPS_CSPACE_GMCS' undeclared (first use in this function)
pstoraster/gdevcups.c:1166: error: `CUPS_CSPACE_KCMYcm' undeclared (first use in this function)
pstoraster/gdevcups.c:1167: error: `CUPS_CSPACE_KCMY' undeclared (first use in this function)
pstoraster/gdevcups.c:1345: error: syntax error before ')' token
pstoraster/gdevcups.c:982: warning: unused variable `rr'
pstoraster/gdevcups.c:982: warning: unused variable `rg'
pstoraster/gdevcups.c:982: warning: unused variable `rb'
pstoraster/gdevcups.c:983: warning: unused variable `ciex'
pstoraster/gdevcups.c:983: warning: unused variable `ciey'
pstoraster/gdevcups.c:983: warning: unused variable `ciez'
pstoraster/gdevcups.c:984: warning: unused variable `ciey_yn'
pstoraster/gdevcups.c:985: warning: unused variable `ciel'
pstoraster/gdevcups.c:985: warning: unused variable `ciea'
pstoraster/gdevcups.c:985: warning: unused variable `cieb'
pstoraster/gdevcups.c: In function `cups_open':
pstoraster/gdevcups.c:2316: error: syntax error before ')' token
pstoraster/gdevcups.c:2318: error: syntax error before ')' token
pstoraster/gdevcups.c:2321: error: syntax error before ')' token
pstoraster/gdevcups.c:2330: warning: implicit declaration of function `ppdOpenFile'
pstoraster/gdevcups.c:2330: warning: assignment makes pointer from integer without a cast
pstoraster/gdevcups.c: In function `cups_print_pages':
pstoraster/gdevcups.c:2362: error: syntax error before ')' token
pstoraster/gdevcups.c:2364: error: `CUPS_ORDER_CHUNKED' undeclared (first use in this function)
pstoraster/gdevcups.c:2365: error: syntax error before ')' token
pstoraster/gdevcups.c:2365: error: syntax error before ')' token
pstoraster/gdevcups.c:2366: error: syntax error before ')' token
pstoraster/gdevcups.c:2369: error: `CUPS_ORDER_BANDED' undeclared (first use in this function)
pstoraster/gdevcups.c:2370: error: syntax error before ')' token
pstoraster/gdevcups.c:2370: error: `CUPS_CSPACE_KCMYcm' undeclared (first use in this function)
pstoraster/gdevcups.c:2371: error: syntax error before ')' token
pstoraster/gdevcups.c:2372: error: syntax error before ')' token
pstoraster/gdevcups.c:2372: error: syntax error before ')' token
pstoraster/gdevcups.c:2373: error: syntax error before ')' token
pstoraster/gdevcups.c:2375: error: syntax error before ')' token
pstoraster/gdevcups.c:2375: error: syntax error before ')' token
pstoraster/gdevcups.c:2376: error: syntax error before ')' token
pstoraster/gdevcups.c:2377: error: syntax error before ')' token
pstoraster/gdevcups.c:2380: error: `CUPS_ORDER_PLANAR' undeclared (first use in this function)
pstoraster/gdevcups.c:2381: error: syntax error before ')' token
pstoraster/gdevcups.c:2381: error: syntax error before ')' token
pstoraster/gdevcups.c:2382: error: syntax error before ')' token
pstoraster/gdevcups.c:2393: error: syntax error before ')' token
pstoraster/gdevcups.c:2393: error: syntax error before ')' token
pstoraster/gdevcups.c:2394: error: syntax error before ')' token
pstoraster/gdevcups.c:2405: error: syntax error before ')' token
pstoraster/gdevcups.c:2415: error: syntax error before ')' token
pstoraster/gdevcups.c:2417: error: syntax error before ')' token
pstoraster/gdevcups.c:2417: warning: implicit declaration of function `cupsRasterOpen'
pstoraster/gdevcups.c:2417: error: syntax error before ')' token
pstoraster/gdevcups.c:2418: error: `CUPS_RASTER_WRITE' undeclared (first use in this function)
pstoraster/gdevcups.c:2432: error: request for member `manual_copies' in something not a structure or union
pstoraster/gdevcups.c:2434: error: syntax error before ')' token
pstoraster/gdevcups.c:2439: error: syntax error before ')' token
pstoraster/gdevcups.c:2439: error: syntax error before ')' token
pstoraster/gdevcups.c:2440: error: syntax error before ')' token
pstoraster/gdevcups.c:2444: warning: implicit declaration of function `cupsRasterWriteHeader'
pstoraster/gdevcups.c:2444: error: syntax error before ')' token
pstoraster/gdevcups.c:2444: error: syntax error before ')' token
pstoraster/gdevcups.c:2449: error: syntax error before ')' token
pstoraster/gdevcups.c:2470: error: syntax error before ')' token
pstoraster/gdevcups.c:2471: error: syntax error before ')' token
pstoraster/gdevcups.c: In function `cups_put_params':
pstoraster/gdevcups.c:2490: error: `ppd_size_t' undeclared (first use in this function)
pstoraster/gdevcups.c:2490: error: `size' undeclared (first use in this function)
pstoraster/gdevcups.c:2581: error: syntax error before ')' token
pstoraster/gdevcups.c:2581: error: syntax error before ')' token
pstoraster/gdevcups.c:2582: error: syntax error before ')' token
pstoraster/gdevcups.c:2582: error: syntax error before ')' token
pstoraster/gdevcups.c:2583: error: syntax error before ')' token
pstoraster/gdevcups.c:2583: error: syntax error before ')' token
pstoraster/gdevcups.c:2584: error: syntax error before ')' token
pstoraster/gdevcups.c:2584: error: syntax error before ')' token
pstoraster/gdevcups.c:2585: error: syntax error before ')' token
pstoraster/gdevcups.c:2586: error: syntax error before ')' token
pstoraster/gdevcups.c:2586: error: `cups_adv_t' undeclared (first use in this function)
pstoraster/gdevcups.c:2586: error: syntax error before "intval"
pstoraster/gdevcups.c:2587: error: syntax error before ')' token
pstoraster/gdevcups.c:2587: error: `CUPS_FALSE' undeclared (first use in this function)
pstoraster/gdevcups.c:2587: error: syntax error before ')' token
pstoraster/gdevcups.c:2587: error: `cups_bool_t' undeclared (first use in this function)
pstoraster/gdevcups.c:2587: error: syntax error before "boolval"
pstoraster/gdevcups.c:2588: error: syntax error before ')' token
pstoraster/gdevcups.c:2588: error: `cups_cut_t' undeclared (first use in this function)
pstoraster/gdevcups.c:2588: error: syntax error before "intval"
pstoraster/gdevcups.c:2589: error: syntax error before ')' token
pstoraster/gdevcups.c:2589: error: syntax error before ')' token
pstoraster/gdevcups.c:2589: error: syntax error before "boolval"
pstoraster/gdevcups.c:2590: error: syntax error before ')' token
pstoraster/gdevcups.c:2590: error: syntax error before ')' token
pstoraster/gdevcups.c:2591: error: syntax error before ')' token
pstoraster/gdevcups.c:2591: error: syntax error before ')' token
pstoraster/gdevcups.c:2591: error: syntax error before "boolval"
pstoraster/gdevcups.c:2592: error: syntax error before ')' token
pstoraster/gdevcups.c:2592: error: `cups_jog_t' undeclared (first use in this function)
pstoraster/gdevcups.c:2592: error: syntax error before "intval"
pstoraster/gdevcups.c:2593: error: syntax error before ')' token
pstoraster/gdevcups.c:2593: error: `cups_edge_t' undeclared (first use in this function)
pstoraster/gdevcups.c:2593: error: syntax error before "intval"
pstoraster/gdevcups.c:2594: error: syntax error before ')' token
pstoraster/gdevcups.c:2594: error: syntax error before ')' token
pstoraster/gdevcups.c:2595: error: syntax error before ')' token
pstoraster/gdevcups.c:2595: error: syntax error before ')' token
pstoraster/gdevcups.c:2595: error: syntax error before "boolval"
pstoraster/gdevcups.c:2596: error: syntax error before ')' token
pstoraster/gdevcups.c:2597: error: syntax error before ')' token
pstoraster/gdevcups.c:2598: error: syntax error before ')' token
pstoraster/gdevcups.c:2599: error: syntax error before ')' token
pstoraster/gdevcups.c:2599: error: syntax error before ')' token
pstoraster/gdevcups.c:2599: error: syntax error before "boolval"
pstoraster/gdevcups.c:2600: error: syntax error before ')' token
pstoraster/gdevcups.c:2600: error: syntax error before ')' token
pstoraster/gdevcups.c:2600: error: syntax error before "boolval"
pstoraster/gdevcups.c:2601: error: syntax error before ')' token
pstoraster/gdevcups.c:2601: error: `cups_orient_t' undeclared (first use in this function)
pstoraster/gdevcups.c:2601: error: syntax error before "intval"
pstoraster/gdevcups.c:2602: error: syntax error before ')' token
pstoraster/gdevcups.c:2602: error: syntax error before ')' token
pstoraster/gdevcups.c:2602: error: syntax error before "boolval"
pstoraster/gdevcups.c:2603: error: syntax error before ')' token
pstoraster/gdevcups.c:2603: error: syntax error before ')' token
pstoraster/gdevcups.c:2603: error: syntax error before "boolval"
pstoraster/gdevcups.c:2604: error: syntax error before ')' token
pstoraster/gdevcups.c:2604: error: syntax error before ')' token
pstoraster/gdevcups.c:2604: error: syntax error before "boolval"
pstoraster/gdevcups.c:2605: error: syntax error before ')' token
pstoraster/gdevcups.c:2605: error: syntax error before ')' token
pstoraster/gdevcups.c:2605: error: syntax error before "boolval"
pstoraster/gdevcups.c:2606: error: syntax error before ')' token
pstoraster/gdevcups.c:2607: error: syntax error before ')' token
pstoraster/gdevcups.c:2608: error: syntax error before ')' token
pstoraster/gdevcups.c:2608: error: `cups_order_t' undeclared (first use in this function)
pstoraster/gdevcups.c:2608: error: syntax error before "intval"
pstoraster/gdevcups.c:2609: error: syntax error before ')' token
pstoraster/gdevcups.c:2609: error: `cups_cspace_t' undeclared (first use in this function)
pstoraster/gdevcups.c:2609: error: syntax error before "intval"
pstoraster/gdevcups.c:2610: error: syntax error before ')' token
pstoraster/gdevcups.c:2611: error: syntax error before ')' token
pstoraster/gdevcups.c:2612: error: syntax error before ')' token
pstoraster/gdevcups.c:2613: error: syntax error before ')' token
pstoraster/gdevcups.c:2671: error: syntax error before ')' token
pstoraster/gdevcups.c:2671: error: syntax error before ')' token
pstoraster/gdevcups.c:2675: error: syntax error before ')' token
pstoraster/gdevcups.c:2683: error: request for member `num_sizes' in something not a structure or union
pstoraster/gdevcups.c:2683: error: request for member `sizes' in something not a structure or union
pstoraster/gdevcups.c:2683: warning: left-hand operand of comma expression has no effect
pstoraster/gdevcups.c:2686: error: syntax error before ')' token
pstoraster/gdevcups.c:2687: error: syntax error before ')' token
pstoraster/gdevcups.c:2712: error: request for member `num_sizes' in something not a structure or union
pstoraster/gdevcups.c:2712: error: request for member `sizes' in something not a structure or union
pstoraster/gdevcups.c:2712: warning: left-hand operand of comma expression has no effect
pstoraster/gdevcups.c:2715: error: syntax error before ')' token
pstoraster/gdevcups.c:2716: error: syntax error before ')' token
pstoraster/gdevcups.c:2729: error: syntax error before ')' token
pstoraster/gdevcups.c:2745: error: request for member `custom_margins' in something not a structure or union
pstoraster/gdevcups.c:2764: error: syntax error before ')' token
pstoraster/gdevcups.c:2765: error: syntax error before ')' token
pstoraster/gdevcups.c:2767: error: syntax error before ')' token
pstoraster/gdevcups.c:2768: error: syntax error before ')' token
pstoraster/gdevcups.c:2770: error: syntax error before ')' token
pstoraster/gdevcups.c:2771: error: syntax error before ')' token
pstoraster/gdevcups.c:2773: error: syntax error before ')' token
pstoraster/gdevcups.c:2774: error: syntax error before ')' token
pstoraster/gdevcups.c:2775: error: syntax error before ')' token
pstoraster/gdevcups.c:2776: error: syntax error before ')' token
pstoraster/gdevcups.c:2789: error: syntax error before ')' token
pstoraster/gdevcups.c:2587: warning: statement with no effect
pstoraster/gdevcups.c:2589: warning: statement with no effect
pstoraster/gdevcups.c:2591: warning: statement with no effect
pstoraster/gdevcups.c:2595: warning: statement with no effect
pstoraster/gdevcups.c:2599: warning: statement with no effect
pstoraster/gdevcups.c:2600: warning: statement with no effect
pstoraster/gdevcups.c:2602: warning: statement with no effect
pstoraster/gdevcups.c:2603: warning: statement with no effect
pstoraster/gdevcups.c:2604: warning: statement with no effect
pstoraster/gdevcups.c:2605: warning: statement with no effect
pstoraster/gdevcups.c:2683: warning: value computed is not used
pstoraster/gdevcups.c:2712: warning: value computed is not used
pstoraster/gdevcups.c: In function `cups_set_color_info':
pstoraster/gdevcups.c:2866: error: `ppd_profile_t' undeclared (first use in this function)
pstoraster/gdevcups.c:2866: error: `profile' undeclared (first use in this function)
pstoraster/gdevcups.c:2871: error: syntax error before ')' token
pstoraster/gdevcups.c:2874: error: `CUPS_CSPACE_W' undeclared (first use in this function)
pstoraster/gdevcups.c:2875: error: `CUPS_CSPACE_K' undeclared (first use in this function)
pstoraster/gdevcups.c:2876: error: `CUPS_CSPACE_WHITE' undeclared (first use in this function)
pstoraster/gdevcups.c:2877: error: `CUPS_CSPACE_GOLD' undeclared (first use in this function)
pstoraster/gdevcups.c:2878: error: `CUPS_CSPACE_SILVER' undeclared (first use in this function)
pstoraster/gdevcups.c:2879: error: syntax error before ')' token
pstoraster/gdevcups.c:2879: error: syntax error before ')' token
pstoraster/gdevcups.c:2880: error: syntax error before ')' token
pstoraster/gdevcups.c:2880: error: syntax error before ')' token
pstoraster/gdevcups.c:2881: error: syntax error before ')' token
pstoraster/gdevcups.c:2884: error: `CUPS_CSPACE_CMY' undeclared (first use in this function)
pstoraster/gdevcups.c:2885: error: `CUPS_CSPACE_YMC' undeclared (first use in this function)
pstoraster/gdevcups.c:2886: error: `CUPS_CSPACE_RGB' undeclared (first use in this function)
pstoraster/gdevcups.c:2887: error: syntax error before ')' token
pstoraster/gdevcups.c:2887: error: `CUPS_ORDER_CHUNKED' undeclared (first use in this function)
pstoraster/gdevcups.c:2888: error: syntax error before ')' token
pstoraster/gdevcups.c:2888: error: syntax error before ')' token
pstoraster/gdevcups.c:2889: error: syntax error before ')' token
pstoraster/gdevcups.c:2890: error: syntax error before ')' token
pstoraster/gdevcups.c:2890: error: syntax error before ')' token
pstoraster/gdevcups.c:2892: error: syntax error before ')' token
pstoraster/gdevcups.c:2892: error: syntax error before ')' token
pstoraster/gdevcups.c:2894: error: syntax error before ')' token
pstoraster/gdevcups.c:2895: error: syntax error before ')' token
pstoraster/gdevcups.c:2895: error: syntax error before ')' token
pstoraster/gdevcups.c:2897: error: syntax error before ')' token
pstoraster/gdevcups.c:2897: error: syntax error before ')' token
pstoraster/gdevcups.c:2899: error: syntax error before ')' token
pstoraster/gdevcups.c:2902: error: `CUPS_CSPACE_KCMYcm' undeclared (first use in this function)
pstoraster/gdevcups.c:2903: error: syntax error before ')' token
pstoraster/gdevcups.c:2905: error: syntax error before ')' token
pstoraster/gdevcups.c:2906: error: syntax error before ')' token
pstoraster/gdevcups.c:2907: error: syntax error before ')' token
pstoraster/gdevcups.c:2911: error: `CUPS_CSPACE_CMYK' undeclared (first use in this function)
pstoraster/gdevcups.c:2912: error: `CUPS_CSPACE_YMCK' undeclared (first use in this function)
pstoraster/gdevcups.c:2913: error: `CUPS_CSPACE_KCMY' undeclared (first use in this function)
pstoraster/gdevcups.c:2914: error: `CUPS_CSPACE_GMCK' undeclared (first use in this function)
pstoraster/gdevcups.c:2915: error: `CUPS_CSPACE_GMCS' undeclared (first use in this function)
pstoraster/gdevcups.c:2916: error: syntax error before ')' token
pstoraster/gdevcups.c:2917: error: syntax error before ')' token
pstoraster/gdevcups.c:2917: error: syntax error before ')' token
pstoraster/gdevcups.c:2919: error: syntax error before ')' token
pstoraster/gdevcups.c:2919: error: syntax error before ')' token
pstoraster/gdevcups.c:2921: error: syntax error before ')' token
pstoraster/gdevcups.c:2921: error: syntax error before ')' token
pstoraster/gdevcups.c:2922: error: syntax error before ')' token
pstoraster/gdevcups.c:2967: error: syntax error before ')' token
pstoraster/gdevcups.c:2970: error: syntax error before ')' token
pstoraster/gdevcups.c:2980: error: syntax error before ')' token
pstoraster/gdevcups.c:2987: error: syntax error before ')' token
pstoraster/gdevcups.c:2991: error: syntax error before ')' token
pstoraster/gdevcups.c:3016: error: syntax error before ')' token
pstoraster/gdevcups.c:3030: error: syntax error before ')' token
pstoraster/gdevcups.c:3034: error: syntax error before ')' token
pstoraster/gdevcups.c:3037: error: syntax error before ')' token
pstoraster/gdevcups.c:3042: error: syntax error before ')' token
pstoraster/gdevcups.c:3046: error: syntax error before ')' token
pstoraster/gdevcups.c:3047: error: syntax error before ')' token
pstoraster/gdevcups.c:3048: error: syntax error before ')' token
pstoraster/gdevcups.c:3049: error: syntax error before ')' token
pstoraster/gdevcups.c:3053: error: syntax error before ')' token
pstoraster/gdevcups.c:3054: error: syntax error before ')' token
pstoraster/gdevcups.c:3055: error: syntax error before ')' token
pstoraster/gdevcups.c:3056: error: syntax error before ')' token
pstoraster/gdevcups.c:3060: error: syntax error before ')' token
pstoraster/gdevcups.c:3061: error: syntax error before ')' token
pstoraster/gdevcups.c:3062: error: syntax error before ')' token
pstoraster/gdevcups.c:3063: error: syntax error before ')' token
pstoraster/gdevcups.c:3072: error: syntax error before ')' token
pstoraster/gdevcups.c:3072: error: syntax error before ')' token
pstoraster/gdevcups.c:3094: error: syntax error before ')' token
pstoraster/gdevcups.c:3098: error: syntax error before ')' token
pstoraster/gdevcups.c:3098: error: syntax error before ')' token
pstoraster/gdevcups.c:3100: error: syntax error before ')' token
pstoraster/gdevcups.c:3100: error: syntax error before ')' token
pstoraster/gdevcups.c:3102: error: syntax error before ')' token
pstoraster/gdevcups.c:3102: error: syntax error before ')' token
pstoraster/gdevcups.c:3104: error: syntax error before ')' token
pstoraster/gdevcups.c:3104: error: syntax error before ')' token
pstoraster/gdevcups.c:3106: error: syntax error before ')' token
pstoraster/gdevcups.c:3106: error: syntax error before ')' token
pstoraster/gdevcups.c:3160: error: request for member `profiles' in something not a structure or union
pstoraster/gdevcups.c:3161: error: request for member `num_profiles' in something not a structure or union
pstoraster/gdevcups.c:3165: error: syntax error before ')' token
pstoraster/gdevcups.c:3165: error: syntax error before ')' token
pstoraster/gdevcups.c:3165: error: syntax error before ')' token
pstoraster/gdevcups.c:3165: error: syntax error before ')' token
pstoraster/gdevcups.c:3165: error: syntax error before ')' token
pstoraster/gdevcups.c:3165: error: syntax error before ')' token
pstoraster/gdevcups.c:3165: error: syntax error before ')' token
pstoraster/gdevcups.c:3165: error: syntax error before ')' token
pstoraster/gdevcups.c:3165: error: syntax error before ')' token
pstoraster/gdevcups.c:3165: error: syntax error before ')' token
pstoraster/gdevcups.c:3165: error: syntax error before ')' token
pstoraster/gdevcups.c:3165: error: syntax error before ')' token
pstoraster/gdevcups.c:3165: error: syntax error before ')' token
pstoraster/gdevcups.c:3165: error: syntax error before ')' token
pstoraster/gdevcups.c:3165: error: syntax error before ')' token
pstoraster/gdevcups.c:3165: error: syntax error before ')' token
pstoraster/gdevcups.c:3165: error: syntax error before ')' token
pstoraster/gdevcups.c:3165: error: syntax error before ')' token
pstoraster/gdevcups.c:3165: error: syntax error before ')' token
pstoraster/gdevcups.c:3165: error: syntax error before ')' token
pstoraster/gdevcups.c:3173: error: request for member `num_profiles' in something not a structure or union
pstoraster/gdevcups.c:3160: warning: value computed is not used
pstoraster/gdevcups.c:3160: warning: value computed is not used
pstoraster/gdevcups.c: In function `cups_sync_output':
pstoraster/gdevcups.c:3225: error: syntax error before ')' token
pstoraster/gdevcups.c: In function `cups_print_chunked':
pstoraster/gdevcups.c:3252: error: syntax error before ')' token
pstoraster/gdevcups.c:3252: error: syntax error before ')' token
pstoraster/gdevcups.c:3253: error: request for member `flip_duplex' in something not a structure or union
pstoraster/gdevcups.c:3253: error: syntax error before ')' token
pstoraster/gdevcups.c:3259: error: syntax error before ')' token
pstoraster/gdevcups.c:3266: error: syntax error before ')' token
pstoraster/gdevcups.c:3285: error: syntax error before ')' token
pstoraster/gdevcups.c:3291: error: syntax error before ')' token
pstoraster/gdevcups.c:3366: warning: implicit declaration of function `cupsRasterWritePixels'
pstoraster/gdevcups.c:3366: error: syntax error before ')' token
pstoraster/gdevcups.c:3366: error: syntax error before ')' token
pstoraster/gdevcups.c:3374: error: syntax error before ')' token
pstoraster/gdevcups.c:3374: error: syntax error before ')' token
pstoraster/gdevcups.c: In function `cups_print_banded':
pstoraster/gdevcups.c:3405: error: syntax error before ')' token
pstoraster/gdevcups.c:3405: error: syntax error before ')' token
pstoraster/gdevcups.c:3406: error: request for member `flip_duplex' in something not a structure or union
pstoraster/gdevcups.c:3406: error: syntax error before ')' token
pstoraster/gdevcups.c:3412: error: syntax error before ')' token
pstoraster/gdevcups.c:3419: error: syntax error before ')' token
pstoraster/gdevcups.c:3419: error: syntax error before ')' token
pstoraster/gdevcups.c:3421: error: syntax error before ')' token
pstoraster/gdevcups.c:3438: error: syntax error before ')' token
pstoraster/gdevcups.c:3452: error: syntax error before ')' token
pstoraster/gdevcups.c:3455: error: syntax error before ')' token
pstoraster/gdevcups.c:3457: error: syntax error before ')' token
pstoraster/gdevcups.c:3460: error: syntax error before ')' token
pstoraster/gdevcups.c:3460: warning: left-hand operand of comma expression has no effect
pstoraster/gdevcups.c:3520: error: `CUPS_CSPACE_GMCK' undeclared (first use in this function)
pstoraster/gdevcups.c:3521: error: `CUPS_CSPACE_GMCS' undeclared (first use in this function)
pstoraster/gdevcups.c:3522: error: `CUPS_CSPACE_RGBA' undeclared (first use in this function)
pstoraster/gdevcups.c:3523: error: `CUPS_CSPACE_CMYK' undeclared (first use in this function)
pstoraster/gdevcups.c:3524: error: `CUPS_CSPACE_YMCK' undeclared (first use in this function)
pstoraster/gdevcups.c:3525: error: `CUPS_CSPACE_KCMY' undeclared (first use in this function)
pstoraster/gdevcups.c:3526: error: syntax error before ')' token
pstoraster/gdevcups.c:3526: warning: left-hand operand of comma expression has no effect
pstoraster/gdevcups.c:3593: error: `CUPS_CSPACE_KCMYcm' undeclared (first use in this function)
pstoraster/gdevcups.c:3594: error: syntax error before ')' token
pstoraster/gdevcups.c:3594: warning: left-hand operand of comma expression has no effect
pstoraster/gdevcups.c:3650: error: syntax error before ')' token
pstoraster/gdevcups.c:3652: error: syntax error before ')' token
pstoraster/gdevcups.c:3655: error: syntax error before ')' token
pstoraster/gdevcups.c:3655: warning: left-hand operand of comma expression has no effect
pstoraster/gdevcups.c:3731: error: syntax error before ')' token
pstoraster/gdevcups.c:3731: warning: left-hand operand of comma expression has no effect
pstoraster/gdevcups.c:3814: error: syntax error before ')' token
pstoraster/gdevcups.c:3816: error: syntax error before ')' token
pstoraster/gdevcups.c:3819: error: syntax error before ')' token
pstoraster/gdevcups.c:3819: warning: left-hand operand of comma expression has no effect
pstoraster/gdevcups.c:3867: error: syntax error before ')' token
pstoraster/gdevcups.c:3867: warning: left-hand operand of comma expression has no effect
pstoraster/gdevcups.c:3918: error: syntax error before ')' token
pstoraster/gdevcups.c:3922: error: syntax error before ')' token
pstoraster/gdevcups.c:3929: error: syntax error before ')' token
pstoraster/gdevcups.c:3944: error: syntax error before ')' token
pstoraster/gdevcups.c:3952: error: syntax error before ')' token
pstoraster/gdevcups.c:3969: error: syntax error before ')' token
pstoraster/gdevcups.c:3969: error: syntax error before ')' token
pstoraster/gdevcups.c: In function `cups_print_planar':
pstoraster/gdevcups.c:4006: error: syntax error before ')' token
pstoraster/gdevcups.c:4023: error: syntax error before ')' token
pstoraster/gdevcups.c:4025: error: syntax error before ')' token
pstoraster/gdevcups.c:4028: error: syntax error before ')' token
pstoraster/gdevcups.c:4030: error: syntax error before ')' token
pstoraster/gdevcups.c:4033: error: syntax error before ')' token
pstoraster/gdevcups.c:4034: warning: left-hand operand of comma expression has no effect
pstoraster/gdevcups.c:4058: error: `CUPS_CSPACE_GMCK' undeclared (first use in this function)
pstoraster/gdevcups.c:4059: error: `CUPS_CSPACE_GMCS' undeclared (first use in this function)
pstoraster/gdevcups.c:4060: error: `CUPS_CSPACE_RGBA' undeclared (first use in this function)
pstoraster/gdevcups.c:4061: error: `CUPS_CSPACE_CMYK' undeclared (first use in this function)
pstoraster/gdevcups.c:4062: error: `CUPS_CSPACE_YMCK' undeclared (first use in this function)
pstoraster/gdevcups.c:4063: error: `CUPS_CSPACE_KCMY' undeclared (first use in this function)
pstoraster/gdevcups.c:4064: error: syntax error before ')' token
pstoraster/gdevcups.c:4065: warning: left-hand operand of comma expression has no effect
pstoraster/gdevcups.c:4089: error: `CUPS_CSPACE_KCMYcm' undeclared (first use in this function)
pstoraster/gdevcups.c:4090: error: syntax error before ')' token
pstoraster/gdevcups.c:4091: warning: left-hand operand of comma expression has no effect
pstoraster/gdevcups.c:4111: error: syntax error before ')' token
pstoraster/gdevcups.c:4113: error: syntax error before ')' token
pstoraster/gdevcups.c:4116: error: syntax error before ')' token
pstoraster/gdevcups.c:4117: warning: left-hand operand of comma expression has no effect
pstoraster/gdevcups.c:4171: error: syntax error before ')' token
pstoraster/gdevcups.c:4172: warning: left-hand operand of comma expression has no effect
pstoraster/gdevcups.c:4226: error: syntax error before ')' token
pstoraster/gdevcups.c:4228: error: syntax error before ')' token
pstoraster/gdevcups.c:4239: error: syntax error before ')' token
pstoraster/gdevcups.c:4239: warning: left-hand operand of comma expression has no effect
pstoraster/gdevcups.c:4283: error: syntax error before ')' token
pstoraster/gdevcups.c:4283: warning: left-hand operand of comma expression has no effect
pstoraster/gdevcups.c:4316: error: syntax error before ')' token
pstoraster/gdevcups.c:4327: error: syntax error before ')' token
pstoraster/gdevcups.c:4327: error: syntax error before ')' token
pstoraster/gdevcups.c:4316: warning: value computed is not used
pstoraster/gdevcups.c: At top level:
pstoraster/gdevcups.c:955: warning: `cups_map_cielab' defined but not used
make: *** [obj/gdevcups.o] Error 1

!!! ERROR: app-text/ghostscript-gnu-8.16-r1 failed.
!!! Function src_compile, Line 90, Exitcode 2
!!! make failed
!!! If you need support, post the topmost build error, NOT this status message.
i´ve run emerge sync, magic and emerge portage.

i´ve run it three times - with no luck...

any ideas?

orochi
Gentoox Guru!
Posts: 606
Joined: Sun Oct 24, 2004 8:11 am

Post by orochi » Thu Apr 06, 2006 6:04 am

do you want printing support? if you dont add -cups to your USE flag, and run

emerge -pv samba to see what will be compiled in

Post Reply

Who is online

Users browsing this forum: No registered users and 11 guests